Error c4430 missing type specifier msdn login

2968

LoginController is probably also defined in some namespace. You need to use its qualified name. What's in LoginController.

Error c4430 missing type specifier msdn login

Advertiser Disclosure: Some of the products that appear on this site are from companies from which TechnologyAdvice receives compensation. This compensation may impact how and where products appear on this site including, for example, the order in which they appear. TechnologyAdvice does not include all companies or all types of products available in the marketplace.

right Without variants.... login error type msdn missing c4430 specifier from it. agree, rather useful

Not sure why this is occurring for me It says on line 72 " error C missing type specifier - int assumed. You haven't declared type of bCapture - static is not a type. When modifying a variable, the static keyword specifies that the variable has static duration it is allocated when the program begins and deallocated when the program ends and initializes it to 0 unless another value is specified.

22 1 EmployeeManagement. Error 3 error C missing type specifier - int assumed. Note: C++ does not support default-int.

I try to build the solution with VS 2015, it gives me the error below.

Join Stack Overflow to learn, share knowledge, and build your career. Find centralized, trusted content and collaborate around the technologies you use most. Connect and share knowledge within a single location that is structured and easy to search.

guzhkov.ru › questions › for-a-template-error-cmissing-type-.

Subscribe to RSS

Sign in Email. Forgot your password? Ask a Question. Please Sign up or sign in to vote. Is it possible? Is there any way of it auto reading between the two languages or will i need to retype everything? Copy Code. Posted Feb am lostandconfused

Without typename, the error shown is error C missing type specifier - int assumed. Note: C++ does not support default-int, at the CItem.

Visual C++ class issue

Join Stack Overflow to learn, share knowledge, and build your career. Find centralized, trusted content and collaborate around the technologies you use most. Connect and share knowledge within a single location that is structured and easy to search. I've seen this and the msdn page but both don't solve my error. EDIT: The reason the first link's solution didn't work was because although adding typename worked for the above code, it didn't work for the below code:. So I thought I was doing the wrong thing by adding typename everywhere. Using typename after the typedef in this code caused this error:. Without typenamethe error shown is error C missing type specifier - int assumed.

error c missing type specifier msdn login. 3>c:\program files (x86)\microsoft directx sdk (june)\include\d3d11shader.h(​35): error C.

local build failure on Windows 7, DirectX SDK related

String ^DataFile; inside the public part of the class wont work. Errors given: error C syntax error: missing ';' before '^'error C missing.

failure to import external C libraries in C++ project

3>c:\program files (x86)\microsoft directx sdk (june )\include\d3d11shader.h(​35): error C missing type specifier - int assumed. Note: C++ does not.

Chromium-dev

error C missing type specifier - int assumed. Note: C++ does not support default-​int RRS feed · Archived Forums. > Visual C. HANDLE Root(); //.

Solution 1

The error log reports syntax errors, like the. error C missing type specifier - int assumed. Note: C++ does not support default-int.

  • Uncaught rangeerror invalid language tag date picker javascript
  • Eliminar error p07 canon mg2410 driver
  • Bug splat error report space marine
  • Ford escape error code p0012
  • X 10 vatten direct draw error
  • Hylian toolbox errors
  • Dpm 2012 error id 811 now
  • C builder json parser error
  • Gapps install error status 6 ocean
  • Java error attribute value must be constant in season
  • Shaw login error in lol
  • File2 exe error 42127
  • Photoshop cc pdf out of memory error
  • Doom 3 absolute hd error checking
  • Wordpress http error media upload crunching the numbers
  • Streets and trips 2011 licensing initialization error
  • Opengl error 1284 stack underflow
  • Porque me aparece error report en operation 7 shmorg
  • Visual basic 6 runtime error 62
  • Ioerror errno 32 broken pipe hadoop map
  • Sybase error 30149
  • Package keyval error frametitle undefined reference
  • Cdr error 30023
  • Error code p0011 infiniti
  • Windows remote desktop error 0x4
  • This email is in use. Thank you. Active 8 years, 9 months ago.